Reaction Details
TargetPeroxisome proliferator-activated receptor delta
LigandBDBM28683
Substrate/CompetitorBDBM28662
Meas. Tech.Radioligand Binding Assay (IC50) and Cell-Based Transcription Assay (EC50)
IC50 10±n/a nM
EC50 13±n/a nM
Citation Shearer, BGPatel, HSBillin, ANWay, JMWinegar, DALambert, MHXu, RXLeesnitzer, LMMerrihew, RVHuet, SWillson, TM Discovery of a novel class of PPARdelta partial agonists. Bioorg Med Chem Lett18:5018-22 (2008) 
 
Peroxisome proliferator-activated receptor delta
Name:Peroxisome proliferator-activated receptor delta
Type:Enzyme
Mol. Mass.:49910.45
Organism:Homo sapiens (Human)
Description:Q03181
Residue:441
BDBM28683
BDBM28662
NameBDBM28683
Synonyms:2-({3-[(4-bromo-1H-indole-1-)sulfonyl]benzene}amido)-5-methylbenzoic acid | Anthranilic acid deriv., 21
TypeSmall organic molecule
Emp. Form.C23H17BrN2O5S
Mol. Mass.513.36
SMILESCc1ccc(NC(=O)c2cccc(c2)S(=O)(=O)n2ccc3c(Br)cccc23)c(c1)C(O)=O