Reaction Details
TargetPeroxisome proliferator-activated receptor delta
LigandBDBM28691
Substrate/CompetitorBDBM28662
Meas. Tech.Radioligand Binding Assay (IC50) and Cell-Based Transcription Assay (EC50)
IC50 4±n/a nM
EC50 79±n/a nM
Citation Shearer, BGPatel, HSBillin, ANWay, JMWinegar, DALambert, MHXu, RXLeesnitzer, LMMerrihew, RVHuet, SWillson, TM Discovery of a novel class of PPARdelta partial agonists. Bioorg Med Chem Lett18:5018-22 (2008) 
 
Peroxisome proliferator-activated receptor delta
Name:Peroxisome proliferator-activated receptor delta
Type:Enzyme
Mol. Mass.:49910.45
Organism:Homo sapiens (Human)
Description:Q03181
Residue:441
BDBM28691
BDBM28662
NameBDBM28691
Synonyms:5-methyl-2-({3-[(7-methyl-1H-indole-1-)sulfonyl]benzene}amido)benzoic acid | Anthranilic acid deriv., 29
TypeSmall organic molecule
Emp. Form.C24H20N2O5S
Mol. Mass.448.491
SMILESCc1ccc(NC(=O)c2cccc(c2)S(=O)(=O)n2ccc3cccc(C)c23)c(c1)C(O)=O