Reaction Details
TargetPeroxisome proliferator-activated receptor delta
LigandBDBM28697
Substrate/CompetitorBDBM28662
Meas. Tech.Radioligand Binding Assay (IC50) and Cell-Based Transcription Assay (EC50)
IC50 13±n/a nM
EC50 100±n/a nM
Citation Shearer, BGPatel, HSBillin, ANWay, JMWinegar, DALambert, MHXu, RXLeesnitzer, LMMerrihew, RVHuet, SWillson, TM Discovery of a novel class of PPARdelta partial agonists. Bioorg Med Chem Lett18:5018-22 (2008) 
 
Peroxisome proliferator-activated receptor delta
Name:Peroxisome proliferator-activated receptor delta
Type:Enzyme
Mol. Mass.:49910.45
Organism:Homo sapiens (Human)
Description:Q03181
Residue:441
BDBM28697
BDBM28662
NameBDBM28697
Synonyms:5-chloro-2-({3-[(6-methoxy-1H-indole-1-)sulfonyl]benzene}amido)benzoic acid | Anthranilic acid deriv., 35
TypeSmall organic molecule
Emp. Form.C23H17ClN2O6S
Mol. Mass.484.909
SMILESCOc1ccc2ccn(c2c1)S(=O)(=O)c1cccc(c1)C(=O)Nc1ccc(Cl)cc1C(O)=O