Reaction Details
TargetPeroxisome proliferator-activated receptor alpha
LigandBDBM28694
Substrate/CompetitorBDBM28680
Meas. Tech.Radioligand Binding Assay
IC50 3162±n/a nM
Citation Shearer, BGPatel, HSBillin, ANWay, JMWinegar, DALambert, MHXu, RXLeesnitzer, LMMerrihew, RVHuet, SWillson, TM Discovery of a novel class of PPARdelta partial agonists. Bioorg Med Chem Lett18:5018-22 (2008) 
 
Peroxisome proliferator-activated receptor alpha
Name:Peroxisome proliferator-activated receptor alpha
Type:Enzyme
Mol. Mass.:52222.08
Organism:Homo sapiens (Human)
Description:Q07869
Residue:468
BDBM28694
BDBM28680
NameBDBM28694
Synonyms:2-({3-[(5-methoxy-4-methyl-1H-indole-1-)sulfonyl]benzene}amido)-5-methylbenzoic acid | Anthranilic acid deriv., 32
TypeSmall organic molecule
Emp. Form.C25H22N2O6S
Mol. Mass.478.517
SMILESCOc1ccc2n(ccc2c1C)S(=O)(=O)c1cccc(c1)C(=O)Nc1ccc(C)cc1C(O)=O