Reaction Details
TargetReceptor-interacting serine/threonine-protein kinase 3
LigandBDBM392804
Substrate/Competitorn/a
Meas. Tech.RIPK3 HTRF Kinase Assay
IC50<30±n/a nM
Citation Hart, ACPitts, WJMastalerz, HGuo, JBrown, GD Substituted dihydro-1H-pyrrolo[3,2-c]pyridin-4(5H)-ones as RIPK3 inhibitors US Patent US10301306 Publication Date 5/28/2019
 
Receptor-interacting serine/threonine-protein kinase 3
Name:Receptor-interacting serine/threonine-protein kinase 3
Type:PROTEIN
Mol. Mass.:56886.12
Organism:Homo sapiens (Human)
Description:ChEMBL_881455
Residue:518
BDBM392804
NameBDBM392804
Synonyms:3-((3-(4-Fluorophenyl)-4-oxo-2-(pyridin-4-yl)-4,5,6,7-tetrahydro-1H-pyrrolo[3,2-c]pyridin-1-yl)methyl)benzonitrile | US10301306, Example 2
TypeSmall organic molecule
Emp. Form.C26H19FN4O
Mol. Mass.422.4537
SMILESFc1ccc(cc1)-c1c2c(CCNC2=O)n(Cc2cccc(c2)C#N)c1-c1ccncc1