Reaction Details
TargetReceptor-interacting serine/threonine-protein kinase 3
LigandBDBM392806
Substrate/Competitorn/a
Meas. Tech.RIPK3 HTRF Kinase Assay
IC50<30±n/a nM
Citation Hart, ACPitts, WJMastalerz, HGuo, JBrown, GD Substituted dihydro-1H-pyrrolo[3,2-c]pyridin-4(5H)-ones as RIPK3 inhibitors US Patent US10301306 Publication Date 5/28/2019
 
Receptor-interacting serine/threonine-protein kinase 3
Name:Receptor-interacting serine/threonine-protein kinase 3
Type:PROTEIN
Mol. Mass.:56886.12
Organism:Homo sapiens (Human)
Description:ChEMBL_881455
Residue:518
BDBM392806
NameBDBM392806
Synonyms:N-(4-(3-(4-Fluorophenyl)-1-(4-methylbenzyl)-4-oxo-4,5,6,7-tetrahydro-1H-pyrrolo[3,2-c]pyridin-2-yl)pyridin-2-yl)acetamide | US10301306, Example 4
TypeSmall organic molecule
Emp. Form.C28H25FN4O2
Mol. Mass.468.5221
SMILESCC(=O)Nc1cc(ccn1)-c1c(c2c(CCNC2=O)n1Cc1ccc(C)cc1)-c1ccc(F)cc1