Reaction Details
TargetReceptor-interacting serine/threonine-protein kinase 3
LigandBDBM392938
Substrate/Competitorn/a
Meas. Tech.RIPK3 HTRF Kinase Assay
IC50<30±n/a nM
Citation Hart, ACPitts, WJMastalerz, HGuo, JBrown, GD Substituted dihydro-1H-pyrrolo[3,2-c]pyridin-4(5H)-ones as RIPK3 inhibitors US Patent US10301306 Publication Date 5/28/2019
 
Receptor-interacting serine/threonine-protein kinase 3
Name:Receptor-interacting serine/threonine-protein kinase 3
Type:PROTEIN
Mol. Mass.:56886.12
Organism:Homo sapiens (Human)
Description:ChEMBL_881455
Residue:518
BDBM392938
NameBDBM392938
Synonyms:US10301306, Example 136
TypeSmall organic molecule
Emp. Form.C26H17Cl2FN4O
Mol. Mass.491.344
SMILESFc1ccc(Cn2c3CCNC(=O)c3c(c2-c2ccncc2)-c2ccc(Cl)c(Cl)c2)c(c1)C#N