Reaction Details
TargetReceptor-interacting serine/threonine-protein kinase 3
LigandBDBM392816
Substrate/Competitorn/a
Meas. Tech.RIPK3 HTRF Kinase Assay
IC50<30±n/a nM
Citation Hart, ACPitts, WJMastalerz, HGuo, JBrown, GD Substituted dihydro-1H-pyrrolo[3,2-c]pyridin-4(5H)-ones as RIPK3 inhibitors US Patent US10301306 Publication Date 5/28/2019
 
Receptor-interacting serine/threonine-protein kinase 3
Name:Receptor-interacting serine/threonine-protein kinase 3
Type:PROTEIN
Mol. Mass.:56886.12
Organism:Homo sapiens (Human)
Description:ChEMBL_881455
Residue:518
BDBM392816
NameBDBM392816
Synonyms:5-Fluoro-2-((4-oxo-2-(pyridin-4-yl)-3-(thiophen-2-yl)-4,5,6,7-tetrahydro-1H-pyrrolo[3,2-c]pyridin-1-yl)methyl)benzonitrile US10301306, Example 144
TypeSmall organic molecule
Emp. Form.C24H17FN4OS
Mol. Mass.428.481
SMILESFc1ccc(Cn2c3CCNC(=O)c3c(-c3cccs3)c2-c2ccncc2)c(c1)C#N