Reaction Details
TargetReceptor-interacting serine/threonine-protein kinase 3
LigandBDBM392953
Substrate/Competitorn/a
Meas. Tech.RIPK3 HTRF Kinase Assay
IC50<30±n/a nM
Citation Hart, ACPitts, WJMastalerz, HGuo, JBrown, GD Substituted dihydro-1H-pyrrolo[3,2-c]pyridin-4(5H)-ones as RIPK3 inhibitors US Patent US10301306 Publication Date 5/28/2019
 
Receptor-interacting serine/threonine-protein kinase 3
Name:Receptor-interacting serine/threonine-protein kinase 3
Type:PROTEIN
Mol. Mass.:56886.12
Organism:Homo sapiens (Human)
Description:ChEMBL_881455
Residue:518
BDBM392953
NameBDBM392953
Synonyms:US10301306, Example 151
TypeSmall organic molecule
Emp. Form.C29H25F5N4O
Mol. Mass.540.527
SMILESCC(C)Nc1cc(ccn1)-c1c(c2c(CCNC2=O)n1Cc1ccc(cc1F)C(F)(F)F)-c1ccc(F)cc1