Reaction Details
TargetReceptor-interacting serine/threonine-protein kinase 3
LigandBDBM392902
Substrate/Competitorn/a
Meas. Tech.RIPK3 HTRF Kinase Assay
IC50<30±n/a nM
Citation Hart, ACPitts, WJMastalerz, HGuo, JBrown, GD Substituted dihydro-1H-pyrrolo[3,2-c]pyridin-4(5H)-ones as RIPK3 inhibitors US Patent US10301306 Publication Date 5/28/2019
 
Receptor-interacting serine/threonine-protein kinase 3
Name:Receptor-interacting serine/threonine-protein kinase 3
Type:PROTEIN
Mol. Mass.:56886.12
Organism:Homo sapiens (Human)
Description:ChEMBL_881455
Residue:518
BDBM392902
NameBDBM392902
Synonyms:US10301306, Example 100 | US10301306, Example 161
TypeSmall organic molecule
Emp. Form.C28H21F2N5O2
Mol. Mass.497.4954
SMILESCC(=O)Nc1cc(ccn1)-c1c(c2c(CCNC2=O)n1Cc1ccc(F)cc1C#N)-c1ccc(F)cc1