Reaction Details
TargetPeroxisome proliferator-activated receptor delta
LigandBDBM28706
Substrate/CompetitorBDBM10852
Meas. Tech.Cell-Based Transcription Assay
EC50 2830±n/a nM
Citation Sierra, MLBeneton, VBoullay, ABBoyer, TBrewster, AGDonche, FForest, MCFouchet, MHGellibert, FJGrillot, DALambert, MHLaroze, ALe Grumelec, CLinget, JMMontana, VGNguyen, VLNicodème, EPatel, VPenfornis, APineau, OPohin, DPotvain, FPoulain, GRuault, CBSaunders, MToum, JXu, HEXu, RXPianetti, PM Substituted 2-[(4-aminomethyl)phenoxy]-2-methylpropionic acid PPARalpha agonists. 1. Discovery of a novel series of potent HDLc raising agents. J Med Chem50:685-95 (2007) 
 
Peroxisome proliferator-activated receptor delta
Name:Peroxisome proliferator-activated receptor delta
Type:Enzyme
Mol. Mass.:49910.45
Organism:Homo sapiens (Human)
Description:Q03181
Residue:441
BDBM28706
BDBM10852
NameBDBM28706
Synonyms:2-methyl-2-phenoxypropanoic acid, 25a CHEMBL219586
TypeSmall organic molecule
Emp. Form.C23H21F3N2O4S
Mol. Mass.478.484
SMILESCc1nc(sc1C(=O)NCc1ccc(OC(C)(C)C(O)=O)cc1)-c1ccc(cc1)C(F)(F)F