Reaction Details
TargetPeroxisome proliferator-activated receptor gamma
LigandBDBM28759
Substrate/CompetitorBDBM10852
Meas. Tech.Cell-Based Transcription Assay
EC50 480±80 nM
Comments35 +/- 6.5 % of maximal activation compared to rosiglitazone normalized to 100%.
Citation Montanari, RSaccoccia, FScotti, ECrestani, MGodio, CGilardi, FLoiodice, FFracchiolla, GLaghezza, ATortorella, PLavecchia, ANovellino, EMazza, FAschi, MPochetti, G Crystal structure of the peroxisome proliferator-activated receptor gamma (PPARgamma) ligand binding domain complexed with a novel partial agonist: a new region of the hydrophobic pocket could be exploited for drug design. J Med Chem51:7768-76 (2008) 
 
Peroxisome proliferator-activated receptor gamma
Name:Peroxisome proliferator-activated receptor gamma
Type:Nuclear Receptor
Mol. Mass.:57613.46
Organism:Homo sapiens (Human)
Description:P37231
Residue:505
BDBM28759
BDBM10852
NameBDBM28759
Synonyms:(2S)-3-phenyl-2-(4-phenylphenoxy)propanoic acid LT175 (S-1)
TypeSmall organic molecule
Emp. Form.C21H18O3
Mol. Mass.318.3658
SMILESOC(=O)[C@H](Cc1ccccc1)Oc1ccc(cc1)-c1ccccc1