Reaction Details
TargetPeroxisome proliferator-activated receptor gamma
LigandBDBM28763
Substrate/Competitor[3H]rosiglitazone
Meas. Tech.Competition Binding Assay (Ki)
pH7.5±n/a
Temperature295.15±n/a K
Ki 971±399 nM
Citation Pochetti, GGodio, CMitro, NCaruso, DGalmozzi, AScurati, SLoiodice, FFracchiolla, GTortorella, PLaghezza, ALavecchia, ANovellino, EMazza, FCrestani, M Insights into the mechanism of partial agonism: crystal structures of the peroxisome proliferator-activated receptor gamma ligand-binding domain in the complex with two enantiomeric ligands. J Biol Chem282:17314-24 (2007) 
 
Peroxisome proliferator-activated receptor gamma
Name:Peroxisome proliferator-activated receptor gamma
Type:Nuclear Receptor
Mol. Mass.:57613.46
Organism:Homo sapiens (Human)
Description:P37231
Residue:505
BDBM28763
[3H]rosiglitazone
NameBDBM28763
Synonyms:(2S)-2-(4-{2-[1,3-benzoxazol-2-yl(heptyl)amino]ethyl}phenoxy)-2-methylbutanoic acid | LT127 (ureidofibrate derivative), (S)-1
TypeSmall organic molecule
Emp. Form.C27H36N2O4
Mol. Mass.452.5857
SMILESCCCCCCCN(CCc1ccc(O[C@@](C)(CC)C(O)=O)cc1)c1nc2ccccc2o1