Reaction Details
TargetPeroxisome proliferator-activated receptor delta
LigandBDBM28769
Substrate/CompetitorBDBM10852
Meas. Tech.Cell-Based Transcription Assay
EC50 70±n/a nM
Comments83% efficacy.
Citation Epple, RAzimioara, MRusso, RXie, YWang, XCow, CWityak, JKaranewsky, DBursulaya, BKreusch, ATuntland, TGerken, AIskandar, MSaez, EMartin Seidel, HTian, SS 3,4,5-Trisubstituted isoxazoles as novel PPARdelta agonists. Part 2. Bioorg Med Chem Lett16:5488-92 (2006) 
 
Peroxisome proliferator-activated receptor delta
Name:Peroxisome proliferator-activated receptor delta
Type:Enzyme
Mol. Mass.:49910.45
Organism:Homo sapiens (Human)
Description:Q03181
Residue:441
BDBM28769
BDBM10852
NameBDBM28769
Synonyms:2-[3-(4-{[2-(2,4-dichlorophenoxy)ethyl]carbamoyl}-5-phenyl-1,2-oxazol-3-yl)phenyl]acetic acid | trisubstituted isoxazole, 17d
TypeSmall organic molecule
Emp. Form.C26H20Cl2N2O5
Mol. Mass.511.353
SMILESOC(=O)Cc1cccc(c1)-c1noc(c1C(=O)NCCOc1ccc(Cl)cc1Cl)-c1ccccc1