Reaction Details
TargetPeroxisome proliferator-activated receptor alpha
LigandBDBM28765
Substrate/CompetitorBDBM10852
Meas. Tech.Cell-Based Transcription Assay
EC50>10000±n/a nM
Citation Epple, RAzimioara, MRusso, RXie, YWang, XCow, CWityak, JKaranewsky, DBursulaya, BKreusch, ATuntland, TGerken, AIskandar, MSaez, EMartin Seidel, HTian, SS 3,4,5-Trisubstituted isoxazoles as novel PPARdelta agonists. Part 2. Bioorg Med Chem Lett16:5488-92 (2006) 
 
Peroxisome proliferator-activated receptor alpha
Name:Peroxisome proliferator-activated receptor alpha
Type:Enzyme
Mol. Mass.:52222.08
Organism:Homo sapiens (Human)
Description:Q07869
Residue:468
BDBM28765
BDBM10852
NameBDBM28765
Synonyms:2-{3-chloro-4-[(4-{[2-(2,4-dichlorophenoxy)ethyl]carbamoyl}-5-phenyl-1,2-oxazol-3-yl)methoxy]phenyl}acetic acid | trisubstituted isoxazole, 11a
TypeSmall organic molecule
Emp. Form.C27H21Cl3N2O6
Mol. Mass.575.824
SMILESOC(=O)Cc1ccc(OCc2noc(c2C(=O)NCCOc2ccc(Cl)cc2Cl)-c2ccccc2)c(Cl)c1