Reaction Details
TargetPeroxisome proliferator-activated receptor gamma
LigandBDBM28775
Substrate/CompetitorBDBM10852
Meas. Tech.Cell-Based Transcription Assay
EC50>10000±n/a nM
Citation Epple, RAzimioara, MRusso, RXie, YWang, XCow, CWityak, JKaranewsky, DBursulaya, BKreusch, ATuntland, TGerken, AIskandar, MSaez, EMartin Seidel, HTian, SS 3,4,5-Trisubstituted isoxazoles as novel PPARdelta agonists. Part 2. Bioorg Med Chem Lett16:5488-92 (2006) 
 
Peroxisome proliferator-activated receptor gamma
Name:Peroxisome proliferator-activated receptor gamma
Type:Nuclear Receptor
Mol. Mass.:57613.46
Organism:Homo sapiens (Human)
Description:P37231
Residue:505
BDBM28775
BDBM10852
NameBDBM28775
Synonyms:2-{3-[5-(2-chlorophenyl)-4-{[2-(2,4-dichlorophenoxy)ethyl]carbamoyl}-1,2-oxazol-3-yl]phenyl}acetic acid | trisubstituted isoxazole, 17j
TypeSmall organic molecule
Emp. Form.C26H19Cl3N2O5
Mol. Mass.545.798
SMILESOC(=O)Cc1cccc(c1)-c1noc(c1C(=O)NCCOc1ccc(Cl)cc1Cl)-c1ccccc1Cl