Reaction Details
TargetPeroxisome proliferator-activated receptor gamma
LigandBDBM28780
Substrate/CompetitorBDBM10852
Meas. Tech.Cell-Based Transcription Assay
EC50 0.19±n/a nM
Citation Oon Han, HKim, SHKim, KHHur, GCJoo Yim, HChung, HKHo Woo, SDong Koo, KLee, CSSung Koh, JKim, GT Design and synthesis of oxime ethers of alpha-acyl-beta-phenylpropanoic acids as PPAR dual agonists. Bioorg Med Chem Lett17:937-41 (2007) 
 
Peroxisome proliferator-activated receptor gamma
Name:Peroxisome proliferator-activated receptor gamma
Type:Nuclear Receptor
Mol. Mass.:57613.46
Organism:Homo sapiens (Human)
Description:P37231
Residue:505
BDBM28780
BDBM10852
NameBDBM28780
Synonyms:(3E)-3-(butoxyimino)-2-({4-[2-(5-methyl-2-phenyl-1,3-oxazol-4-yl)ethoxy]phenyl}methyl)butanoic acid | alpha-acyl-beta-phenylpropanoic acid deriv., 11e
TypeSmall organic molecule
Emp. Form.C27H32N2O5
Mol. Mass.464.5534
SMILESCCCCO\N=C(/C)C(Cc1ccc(OCCc2nc(oc2C)-c2ccccc2)cc1)C(O)=O