Reaction Details
TargetPeroxisome proliferator-activated receptor gamma
LigandBDBM28781
Substrate/CompetitorBDBM10852
Meas. Tech.Cell-Based Transcription Assay
EC50 0.36±n/a nM
Citation Oon Han, HKim, SHKim, KHHur, GCJoo Yim, HChung, HKHo Woo, SDong Koo, KLee, CSSung Koh, JKim, GT Design and synthesis of oxime ethers of alpha-acyl-beta-phenylpropanoic acids as PPAR dual agonists. Bioorg Med Chem Lett17:937-41 (2007) 
 
Peroxisome proliferator-activated receptor gamma
Name:Peroxisome proliferator-activated receptor gamma
Type:Nuclear Receptor
Mol. Mass.:57613.46
Organism:Homo sapiens (Human)
Description:P37231
Residue:505
BDBM28781
BDBM10852
NameBDBM28781
Synonyms:(3E)-3-[(cyclopropylmethoxy)imino]-2-({4-[2-(5-methyl-2-phenyl-1,3-oxazol-4-yl)ethoxy]phenyl}methyl)butanoic acid | alpha-acyl-beta-phenylpropanoic acid deriv., 11f
TypeSmall organic molecule
Emp. Form.C27H30N2O5
Mol. Mass.462.5375
SMILESC\C(=N/OCC1CC1)C(Cc1ccc(OCCc2nc(oc2C)-c2ccccc2)cc1)C(O)=O