Reaction Details
TargetPeroxisome proliferator-activated receptor alpha
LigandBDBM28798
Substrate/CompetitorBDBM10852
Meas. Tech.Cell-Based Transcription Assay
EC50 9798±n/a nM
Citation Oon Han, HKim, SHKim, KHHur, GCJoo Yim, HChung, HKHo Woo, SDong Koo, KLee, CSSung Koh, JKim, GT Design and synthesis of oxime ethers of alpha-acyl-beta-phenylpropanoic acids as PPAR dual agonists. Bioorg Med Chem Lett17:937-41 (2007) 
 
Peroxisome proliferator-activated receptor alpha
Name:Peroxisome proliferator-activated receptor alpha
Type:Enzyme
Mol. Mass.:52222.08
Organism:Homo sapiens (Human)
Description:Q07869
Residue:468
BDBM28798
BDBM10852
NameBDBM28798
Synonyms:(2S)-2-ethoxy-3-(4-{2-[4-(methanesulfonyloxy)phenyl]ethoxy}phenyl)propanoic acid Galida | tesaglitazar
TypeSmall organic molecule
Emp. Form.C20H24O7S
Mol. Mass.408.465
SMILESCCO[C@@H](Cc1ccc(OCCc2ccc(OS(C)(=O)=O)cc2)cc1)C(O)=O