Reaction Details
TargetDihydroorotate dehydrogenase (quinone), mitochondrial [100-517]
LigandBDBM28843
Substrate/CompetitorBDBM14700
Meas. Tech.DHODH Inhibition Assay
IC50 260±n/a nM
Citation Gujjar, RMarwaha, AEl Mazouni, FWhite, JWhite, KLCreason, SShackleford, DMBaldwin, JCharman, WNBuckner, FSCharman, SRathod, PKPhillips, MA Identification of a metabolically stable triazolopyrimidine-based dihydroorotate dehydrogenase inhibitor with antimalarial activity in mice. J Med Chem52:1864-72 (2009) 
 
Dihydroorotate dehydrogenase (quinone), mitochondrial [100-517]
Name:Dihydroorotate dehydrogenase (quinone), mitochondrial [100-517]
Type:Enzyme
Mol. Mass.:47311.25
Organism:Plasmodium berghei
Description:A0A509AEH5[100-517]
Residue:418
BDBM28843
BDBM14700
NameBDBM28843
Synonyms:N-[3-fluoro-4-(trifluoromethyl)phenyl]-5-methyl-[1,2,4]triazolo[1,5-a]pyrimidin-7-amine | triazolopyrimidine-based compound, DSM125
TypeSmall organic molecule
Emp. Form.C13H9F4N5
Mol. Mass.311.2377
SMILESCc1cc(Nc2ccc(c(F)c2)C(F)(F)F)n2ncnc2n1