Reaction Details
TargetSerine/threonine-protein kinase pim-1
LigandBDBM393298
Substrate/Competitorn/a
Meas. Tech.Biological Assay
Ki 0.002±n/a nM
Citation Burch, JChen, HWang, X Oxepan-2-yl-pyrazol-4-yl-heterocyclyl-carboxamide compounds and methods of use US Patent US9963446 Publication Date 5/8/2018
 
Serine/threonine-protein kinase pim-1
Name:Serine/threonine-protein kinase pim-1
Type:Protein
Mol. Mass.:35681.82
Organism:Homo sapiens (Human)
Description:P11309
Residue:313
BDBM393298
NameBDBM393298
Synonyms:N-(5-((2S,5R,6S)-5-amino-6- fluorooxepan-2-yl)-1-methyl- 1H-pyrazol-4-yl)-2-(2,6- difluoro-4-((S)-1- fluoroethyl)phenyl)thiazole-4- carboxamide | US9963446, Example 101
TypeSmall organic molecule
Emp. Form.C22H23F4N5O2S
Mol. Mass.497.509
SMILESC[C@H](F)c1cc(F)c(-c2nc(cs2)C(=O)Nc2cnn(C)c2[C@@H]2CC[C@@H](N)[C@H](F)CO2)c(F)c1