Reaction Details
TargetSerine/threonine-protein kinase pim-1
LigandBDBM393434
Substrate/Competitorn/a
Meas. Tech.Biological Assay
Ki 0.005±n/a nM
Citation Burch, JChen, HWang, X Oxepan-2-yl-pyrazol-4-yl-heterocyclyl-carboxamide compounds and methods of use US Patent US9963446 Publication Date 5/8/2018
 
Serine/threonine-protein kinase pim-1
Name:Serine/threonine-protein kinase pim-1
Type:Protein
Mol. Mass.:35681.82
Organism:Homo sapiens (Human)
Description:P11309
Residue:313
BDBM393434
NameBDBM393434
Synonyms:N-(5-((2S,5R,6R,7S)-5-amino-6- fluoro-7-methyloxepan-2-yl)-1- methyl-1H-pyrazol-4-yl)-2-(2,6- difluorophenyl)thiazole-4- carboxamide | US9963446, Example 121
TypeSmall organic molecule
Emp. Form.C21H22F3N5O2S
Mol. Mass.465.492
SMILESC[C@@H]1O[C@@H](CC[C@@H](N)[C@H]1F)c1c(NC(=O)c2csc(n2)-c2c(F)cccc2F)cnn1C