Reaction Details
TargetDihydroorotate dehydrogenase (quinone), mitochondrial
LigandBDBM29024
Substrate/CompetitorBDBM14700
Meas. Tech.DHODH Inhibition Assay
Ki 14±n/a nM
IC50 117±n/a nM
Citation Davies, MHeikkilä, TMcConkey, GAFishwick, CWParsons, MRJohnson, AP Structure-based design, synthesis, and characterization of inhibitors of human and Plasmodium falciparum dihydroorotate dehydrogenases. J Med Chem52:2683-93 (2009) 
 
Dihydroorotate dehydrogenase (quinone), mitochondrial
Name:Dihydroorotate dehydrogenase (quinone), mitochondrial
Type:Enzyme
Mol. Mass.:42881.33
Organism:Homo sapiens (Human)
Description:Q02127
Residue:395
BDBM29024
BDBM14700
NameBDBM29024
Synonyms:CHEMBL141732 | cyanocyclopropylpropenamide, 4
TypeSmall organic molecule
Emp. Form.C14H11F3N2O2
Mol. Mass.296.2445
SMILESFC(F)(F)c1ccc(NC(=O)C(C#N)C(=O)C2CC2)cc1