Reaction Details
TargetDihydroorotate dehydrogenase (quinone), mitochondrial
LigandBDBM29039
Substrate/CompetitorBDBM14700
Meas. Tech.DHODH Inhibition Assay
Ki 16±n/a nM
IC50 130±n/a nM
Citation Davies, MHeikkilä, TMcConkey, GAFishwick, CWParsons, MRJohnson, AP Structure-based design, synthesis, and characterization of inhibitors of human and Plasmodium falciparum dihydroorotate dehydrogenases. J Med Chem52:2683-93 (2009) 
 
Dihydroorotate dehydrogenase (quinone), mitochondrial
Name:Dihydroorotate dehydrogenase (quinone), mitochondrial
Type:Enzyme
Mol. Mass.:42881.33
Organism:Homo sapiens (Human)
Description:Q02127
Residue:395
BDBM29039
BDBM14700
NameBDBM29039
Synonyms:cyanohydroxybutenamide, 29
TypeSmall organic molecule
Emp. Form.C19H18N2O3
Mol. Mass.322.3578
SMILESCCOc1cccc(c1)-c1ccc(NC(=O)C(C#N)C(C)=O)cc1