Reaction Details
TargetCannabinoid receptor 1
LigandBDBM21278
Substrate/CompetitorBDBM21278
Meas. Tech.CB1 Radioligand Binding Assay (Ki) and GTP-gamma-[35S] Binding Assay (EC50)
pH7.4±n/a
Temperature303.15±n/a K
Ki 1.8±1.4 nM
EC50 1.6±0.7 nM
Citation Dow, RLCarpino, PAHadcock, JRBlack, SCIredale, PADaSilva-Jardine, PSchneider, SRPaight, ESGriffith, DAScott, DOO'Connor, RENduaka, CI Discovery of 2-(2-chlorophenyl)-3-(4-chlorophenyl)-7-(2,2-difluoropropyl)-6,7-dihydro-2H-pyrazolo[3,4-f][1,4]oxazepin-8(5H)-one (PF-514273), a novel, bicyclic lactam-based cannabinoid-1 receptor antagonist for the treatment of obesity. J Med Chem52:2652-5 (2009) 
 
Cannabinoid receptor 1
Name:Cannabinoid receptor 1
Type:G Protein-Coupled Receptor (GPCR)
Mol. Mass.:52868.96
Organism:Homo sapiens (Human)
Description:P21554
Residue:472
BDBM21278
BDBM21278
NameBDBM21278
Synonyms:5-(4-chlorophenyl)-1-(2,4-dichlorophenyl)-4-methyl-N-(piperidin-1-yl)-1H-pyrazole-3-carboxamide CHEMBL111 RIMONABANT HYDROCHLORIDE SR 141716A SR141716A [3H]SR141716A
TypeSmall organic molecule
Emp. Form.C22H21Cl3N4O
Mol. Mass.463.787
SMILESCc1c(nn(c1-c1ccc(Cl)cc1)-c1ccc(Cl)cc1Cl)C(=O)NN1CCCCC1