Reaction Details
TargetCannabinoid receptor 1
LigandBDBM29061
Substrate/CompetitorBDBM21278
Meas. Tech.CB1 Radioligand Binding Assay (Ki) and GTP-gamma-[35S] Binding Assay (EC50)
pH7.4±n/a
Temperature303.15±n/a K
Ki 0.6±0.1 nM
EC50 1.0±n/a nM
Citation Dow, RLCarpino, PAHadcock, JRBlack, SCIredale, PADaSilva-Jardine, PSchneider, SRPaight, ESGriffith, DAScott, DOO'Connor, RENduaka, CI Discovery of 2-(2-chlorophenyl)-3-(4-chlorophenyl)-7-(2,2-difluoropropyl)-6,7-dihydro-2H-pyrazolo[3,4-f][1,4]oxazepin-8(5H)-one (PF-514273), a novel, bicyclic lactam-based cannabinoid-1 receptor antagonist for the treatment of obesity. J Med Chem52:2652-5 (2009) 
 
Cannabinoid receptor 1
Name:Cannabinoid receptor 1
Type:G Protein-Coupled Receptor (GPCR)
Mol. Mass.:52868.96
Organism:Homo sapiens (Human)
Description:P21554
Residue:472
BDBM29061
BDBM21278
NameBDBM29061
Synonyms:CHEMBL201602 | pyrazolopyrimidinone-based antagonist, 3
Typen/a
Emp. Form.C20H13Cl2F3N4O
Mol. Mass.453.245
SMILESCc1nc2c(-c3ccc(Cl)cc3)n(nc2c(=O)n1CC(F)(F)F)-c1ccccc1Cl