Reaction Details
TargetCannabinoid receptor 1
LigandBDBM29073
Substrate/CompetitorBDBM21278
Meas. Tech.CB1 Radioligand Binding Assay (Ki) and GTP-gamma-[35S] Binding Assay (EC50)
pH7.4±n/a
Temperature303.15±n/a K
Ki 1.3±n/a nM
EC50 4.8±n/a nM
Citation Dow, RLCarpino, PAHadcock, JRBlack, SCIredale, PADaSilva-Jardine, PSchneider, SRPaight, ESGriffith, DAScott, DOO'Connor, RENduaka, CI Discovery of 2-(2-chlorophenyl)-3-(4-chlorophenyl)-7-(2,2-difluoropropyl)-6,7-dihydro-2H-pyrazolo[3,4-f][1,4]oxazepin-8(5H)-one (PF-514273), a novel, bicyclic lactam-based cannabinoid-1 receptor antagonist for the treatment of obesity. J Med Chem52:2652-5 (2009) 
 
Cannabinoid receptor 1
Name:Cannabinoid receptor 1
Type:G Protein-Coupled Receptor (GPCR)
Mol. Mass.:52868.96
Organism:Homo sapiens (Human)
Description:P21554
Residue:472
BDBM29073
BDBM21278
NameBDBM29073
Synonyms:ether-based lactam, 19b
TypeSmall organic molecule
Emp. Form.C21H19Cl2N3O2
Mol. Mass.416.3
SMILESCC(C)N1CCOc2c(nn(c2-c2ccc(Cl)cc2)-c2ccccc2Cl)C1=O