Reaction Details
TargetCannabinoid receptor 2
LigandBDBM29070
Substrate/CompetitorBDBM21244
Meas. Tech.CB1 Radioligand Binding Assay (Ki) and GTP-gamma-[35S] Binding Assay (EC50)
Ki>10000±n/a nM
Citation Dow, RLCarpino, PAHadcock, JRBlack, SCIredale, PADaSilva-Jardine, PSchneider, SRPaight, ESGriffith, DAScott, DOO'Connor, RENduaka, CI Discovery of 2-(2-chlorophenyl)-3-(4-chlorophenyl)-7-(2,2-difluoropropyl)-6,7-dihydro-2H-pyrazolo[3,4-f][1,4]oxazepin-8(5H)-one (PF-514273), a novel, bicyclic lactam-based cannabinoid-1 receptor antagonist for the treatment of obesity. J Med Chem52:2652-5 (2009) 
 
Cannabinoid receptor 2
Name:Cannabinoid receptor 2
Type:G Protein-Coupled Receptor (GPCR)
Mol. Mass.:39690.94
Organism:Homo sapiens (Human)
Description:P34972
Residue:360
BDBM29070
BDBM21244
NameBDBM29070
Synonyms:lactam-based compound, 12i
TypeSmall organic molecule
Emp. Form.C21H17Cl2F2N3O
Mol. Mass.436.282
SMILESCC(F)(F)CN1CCc2c(nn(c2-c2ccc(Cl)cc2)-c2ccccc2Cl)C1=O