Reaction Details
TargetCannabinoid receptor 2
LigandBDBM29076
Substrate/CompetitorBDBM21244
Meas. Tech.CB1 Radioligand Binding Assay (Ki) and GTP-gamma-[35S] Binding Assay (EC50)
Ki>10000±n/a nM
Citation Dow, RLCarpino, PAHadcock, JRBlack, SCIredale, PADaSilva-Jardine, PSchneider, SRPaight, ESGriffith, DAScott, DOO'Connor, RENduaka, CI Discovery of 2-(2-chlorophenyl)-3-(4-chlorophenyl)-7-(2,2-difluoropropyl)-6,7-dihydro-2H-pyrazolo[3,4-f][1,4]oxazepin-8(5H)-one (PF-514273), a novel, bicyclic lactam-based cannabinoid-1 receptor antagonist for the treatment of obesity. J Med Chem52:2652-5 (2009) 
 
Cannabinoid receptor 2
Name:Cannabinoid receptor 2
Type:G Protein-Coupled Receptor (GPCR)
Mol. Mass.:39690.94
Organism:Homo sapiens (Human)
Description:P34972
Residue:360
BDBM29076
BDBM21244
NameBDBM29076
Synonyms:ether-based lactam, 19e
TypeSmall organic molecule
Emp. Form.C22H19Cl2F2N3O2
Mol. Mass.466.308
SMILESCCC(F)(F)CN1CCOc2c(nn(c2-c2ccc(Cl)cc2)-c2ccccc2Cl)C1=O