Reaction Details
TargetCannabinoid receptor 1
LigandBDBM20461
Substrate/CompetitorBDBM21244
Meas. Tech.CB Receptor Radioligand Binding Assay (Ki)
pH7.4±n/a
Temperature303.15±n/a K
Ki>10000±n/a nM
Citation Appendino, GLigresti, AMinassi, ACascio, MGAllarà, MTaglialatela-Scafati, OPertwee, RGDe Petrocellis, LDi Marzo, V Conformationally constrained fatty acid ethanolamides as cannabinoid and vanilloid receptor probes. J Med Chem52:3001-9 (2009) 
 
Cannabinoid receptor 1
Name:Cannabinoid receptor 1
Type:G Protein-Coupled Receptor (GPCR)
Mol. Mass.:52868.96
Organism:Homo sapiens (Human)
Description:P21554
Residue:472
BDBM20461
BDBM21244
NameBDBM20461
Synonyms:(6E)-N-[(4-hydroxy-3-methoxyphenyl)methyl]-8-methylnon-6-enamide CAP Capsaicin | Zostrix
Typen/a
Emp. Form.C18H27NO3
Mol. Mass.305.4119
SMILESCOc1cc(CNC(=O)CCCC\C=C\C(C)C)ccc1O