Reaction Details
TargetCannabinoid receptor 2
LigandBDBM22988
Substrate/CompetitorBDBM21244
Meas. Tech.CB Receptor Radioligand Binding Assay (Ki)
pH7.4±n/a
Temperature303.15±n/a K
Ki 168±2 nM
Citation Appendino, GLigresti, AMinassi, ACascio, MGAllarà, MTaglialatela-Scafati, OPertwee, RGDe Petrocellis, LDi Marzo, V Conformationally constrained fatty acid ethanolamides as cannabinoid and vanilloid receptor probes. J Med Chem52:3001-9 (2009) 
 
Cannabinoid receptor 2
Name:Cannabinoid receptor 2
Type:G Protein-Coupled Receptor (GPCR)
Mol. Mass.:39690.94
Organism:Homo sapiens (Human)
Description:P34972
Residue:360
BDBM22988
BDBM21244
NameBDBM22988
Synonyms:(5Z,8Z,11Z,14Z)-N-(2-hydroxyethyl)icosa-5,8,11,14-tetraenamide ANANDAMIDE Arachidonoyl ethanolamide (AEA) Arachidonylethanolamide [14C]Anandamide | [3H]Anandamide
Typeradiolabeled substrate
Emp. Form.C22H37NO2
Mol. Mass.347.5347
SMILESCCCCC\C=C/C\C=C/C\C=C/C\C=C/CCCC(=O)NCCO