Reaction Details
TargetCannabinoid receptor 2
LigandBDBM29078
Substrate/CompetitorBDBM21244
Meas. Tech.CB Receptor Radioligand Binding Assay (Ki)
pH7.4±n/a
Temperature303.15±n/a K
Ki 200±3 nM
Citation Appendino, GLigresti, AMinassi, ACascio, MGAllarà, MTaglialatela-Scafati, OPertwee, RGDe Petrocellis, LDi Marzo, V Conformationally constrained fatty acid ethanolamides as cannabinoid and vanilloid receptor probes. J Med Chem52:3001-9 (2009) 
 
Cannabinoid receptor 2
Name:Cannabinoid receptor 2
Type:G Protein-Coupled Receptor (GPCR)
Mol. Mass.:39690.94
Organism:Homo sapiens (Human)
Description:P34972
Residue:360
BDBM29078
BDBM21244
NameBDBM29078
Synonyms:cyclopropanolamide, 13a racemic
TypeSmall organic molecule
Emp. Form.C23H37NO2
Mol. Mass.359.5454
SMILESCCCCC\C=C/C\C=C/C\C=C/C\C=C/CCCC(=O)N[C@@H]1C[C@@H]1O