Reaction Details
TargetCannabinoid receptor 2
LigandBDBM29093
Substrate/CompetitorBDBM21244
Meas. Tech.CB Receptor Radioligand Binding Assay (Ki)
Ki 2420±n/a nM
Citation Appendino, GLigresti, AMinassi, ACascio, MGAllarà, MTaglialatela-Scafati, OPertwee, RGDe Petrocellis, LDi Marzo, V Conformationally constrained fatty acid ethanolamides as cannabinoid and vanilloid receptor probes. J Med Chem52:3001-9 (2009) 
 
Cannabinoid receptor 2
Name:Cannabinoid receptor 2
Type:G Protein-Coupled Receptor (GPCR)
Mol. Mass.:39690.94
Organism:Homo sapiens (Human)
Description:P34972
Residue:360
BDBM29093
BDBM21244
NameBDBM29093
Synonyms:cyclopropanolamide, 11b
TypeSmall organic molecule
Emp. Form.C21H39NO2
Mol. Mass.337.5399
SMILESCCCCCCCC\C=C/CCCCCCCC(=O)N[C@H]1C[C@@H]1O