Reaction Details
TargetCannabinoid receptor 1
LigandBDBM29096
Substrate/CompetitorBDBM21278
Meas. Tech.CB Receptor Radioligand Binding Assay (Ki)
pH7.2±n/a
Temperature295.15±n/a K
Ki 0.32±0.07 nM
Citation Pettersson, HBülow, AEk, FJensen, JOttesen, LKFejzic, AMa, JNDel Tredici, ALCurrier, EAGardell, LRTabatabaei, ACraig, DMcFarland, KOtt, TRPiu, FBurstein, ESOlsson, R Synthesis and evaluation of dibenzothiazepines: a novel class of selective cannabinoid-1 receptor inverse agonists. J Med Chem52:1975-82 (2009) 
 
Cannabinoid receptor 1
Name:Cannabinoid receptor 1
Type:G Protein-Coupled Receptor (GPCR)
Mol. Mass.:52868.96
Organism:Homo sapiens (Human)
Description:P21554
Residue:472
BDBM29096
BDBM21278
NameBDBM29096
Synonyms:dibenzothiazepine, 12b
TypeSmall organic molecule
Emp. Form.C26H24ClN3OS
Mol. Mass.462.006
SMILESClc1cccc(CNC(=O)c2ccc3Sc4ccccc4C(=Nc3c2)N2CCCCC2)c1