Reaction Details
TargetCannabinoid receptor 1
LigandBDBM29102
Substrate/CompetitorBDBM21278
Meas. Tech.CB Receptor Radioligand Binding Assay (Ki)
pH7.2±n/a
Temperature295.15±n/a K
Ki 1.6±n/a nM
Citation Pettersson, HBülow, AEk, FJensen, JOttesen, LKFejzic, AMa, JNDel Tredici, ALCurrier, EAGardell, LRTabatabaei, ACraig, DMcFarland, KOtt, TRPiu, FBurstein, ESOlsson, R Synthesis and evaluation of dibenzothiazepines: a novel class of selective cannabinoid-1 receptor inverse agonists. J Med Chem52:1975-82 (2009) 
 
Cannabinoid receptor 1
Name:Cannabinoid receptor 1
Type:G Protein-Coupled Receptor (GPCR)
Mol. Mass.:52868.96
Organism:Homo sapiens (Human)
Description:P21554
Residue:472
BDBM29102
BDBM21278
NameBDBM29102
Synonyms:dibenzothiazepine, 12k
TypeSmall organic molecule
Emp. Form.C24H23N3OS
Mol. Mass.401.524
SMILESCC(C)CCNC(=O)c1ccc2Sc3ccccc3C(=Nc2c1)c1ccccn1