Reaction Details
TargetRibosyldihydronicotinamide dehydrogenase [quinone]
LigandBDBM29216
Substrate/CompetitorBDBM29211
Meas. Tech.QR2 Assay and IC50 Value Determination
pH7.5±n/a
Temperature296.15±n/a K
IC50 24100±3400 nM
Citation Maiti, AReddy, PVSturdy, MMarler, LPegan, SDMesecar, ADPezzuto, JMCushman, M Synthesis of casimiroin and optimization of its quinone reductase 2 and aromatase inhibitory activities. J Med Chem52:1873-84 (2009) 
 
Ribosyldihydronicotinamide dehydrogenase [quinone]
Name:Ribosyldihydronicotinamide dehydrogenase [quinone]
Type:Protein
Mol. Mass.:25917.25
Organism:Homo sapiens (Human)
Description:P16083
Residue:231
BDBM29216
BDBM29211
NameBDBM29216
Synonyms:casimiroin analogue, 1e
TypeSmall organic molecule
Emp. Form.C11H11NO2
Mol. Mass.189.2105
SMILESCOc1cccc2c(C)cc(=O)[nH]c12