Reaction Details
TargetAromatase
LigandBDBM29216
Substrate/CompetitorBDBM29231
Meas. Tech.QR2 Assay and IC50 Value Determination
IC50>105800±n/a nM
Citation Maiti, AReddy, PVSturdy, MMarler, LPegan, SDMesecar, ADPezzuto, JMCushman, M Synthesis of casimiroin and optimization of its quinone reductase 2 and aromatase inhibitory activities. J Med Chem52:1873-84 (2009) 
 
Aromatase
Name:Aromatase
Type:Enzyme
Mol. Mass.:57888.92
Organism:Homo sapiens (Human)
Description:P11511
Residue:503
BDBM29216
BDBM29231
NameBDBM29216
Synonyms:casimiroin analogue, 1e
TypeSmall organic molecule
Emp. Form.C11H11NO2
Mol. Mass.189.2105
SMILESCOc1cccc2c(C)cc(=O)[nH]c12