Reaction Details
TargetNitric oxide synthase, inducible
LigandBDBM29252
Substrate/CompetitorBDBM10852
Meas. Tech.Cell-Based NOS Transient Transfection Assay
Temperature298.15±n/a K
EC50 9±3 nM
Commentsextracted
Citation Bonnefous, CPayne, JERoppe, JZhuang, HChen, XSymons, KTNguyen, PMSablad, MRozenkrants, NZhang, YWang, LSeverance, DWalsh, JPYazdani, NShiau, AKNoble, SARix, PRao, TSHassig, CASmith, ND Discovery of inducible nitric oxide synthase (iNOS) inhibitor development candidate KD7332, part 1: Identification of a novel, potent, and selective series of quinolinone iNOS dimerization inhibitors that are orally active in rodent pain models. J Med Chem52:3047-62 (2009) 
 
Nitric oxide synthase, inducible
Name:Nitric oxide synthase, inducible
Type:Homodimer
Mol. Mass.:131141.95
Organism:Homo sapiens (Human)
Description:P35228
Residue:1153
BDBM29252
BDBM10852
NameBDBM29252
Synonyms:quinolinone, 23
TypeSmall organic molecule
Emp. Form.C21H16ClFN4O2
Mol. Mass.410.829
SMILESCn1cncc1C(=O)N(Cc1cc(=O)[nH]c2c(F)cccc12)c1cccc(Cl)c1