Reaction Details
TargetCarbonic anhydrase
LigandBDBM29277
Substrate/CompetitorBDBM10856
Meas. Tech.CA Inhibition Assay
pH8.3±n/a
Temperature293.15±n/a K
Ki 7830±n/a nM
Citation Nishimori, IMinakuchi, TVullo, DScozzafava, AInnocenti, ASupuran, CT Carbonic anhydrase inhibitors. Cloning, characterization, and inhibition studies of a new beta-carbonic anhydrase from Mycobacterium tuberculosis. J Med Chem52:3116-20 (2009) 
 
Carbonic anhydrase
Name:Carbonic anhydrase
Type:Enzyme
Mol. Mass.:69636.39
Organism:Mycobacterium tuberculosis
Description:R4ML78
Residue:655
BDBM29277
BDBM10856
NameBDBM29277
Synonyms:CHEMBL451332 | sulfonamide, 3
TypeSmall organic molecule
Emp. Form.C9H11NO4S
Mol. Mass.229.253
SMILESNS(=O)(=O)c1ccc(CCC(O)=O)cc1