Reaction Details
TargetCarbonic anhydrase
LigandBDBM10859
Substrate/CompetitorBDBM10856
Meas. Tech.CA Inhibition Assay
pH8.3±n/a
Temperature293.15±n/a K
Ki 7020±n/a nM
Citation Nishimori, IMinakuchi, TVullo, DScozzafava, AInnocenti, ASupuran, CT Carbonic anhydrase inhibitors. Cloning, characterization, and inhibition studies of a new beta-carbonic anhydrase from Mycobacterium tuberculosis. J Med Chem52:3116-20 (2009) 
 
Carbonic anhydrase
Name:Carbonic anhydrase
Type:Enzyme
Mol. Mass.:69636.39
Organism:Mycobacterium tuberculosis
Description:R4ML78
Residue:655
BDBM10859
BDBM10856
NameBDBM10859
Synonyms:4-methylbenzene-1-sulfonamide aromatic/heteroaromatic sulfonamide 4 | hCA inhibitor, 7
TypeSmall organic molecule
Emp. Form.C7H9NO2S
Mol. Mass.171.217
SMILESCc1ccc(cc1)S(N)(=O)=O