Reaction Details
TargetCarbonic anhydrase
LigandBDBM10877
Substrate/CompetitorBDBM10856
Meas. Tech.CA Inhibition Assay
pH8.3±n/a
Temperature293.15±n/a K
Ki 2510±n/a nM
Citation Nishimori, IMinakuchi, TVullo, DScozzafava, AInnocenti, ASupuran, CT Carbonic anhydrase inhibitors. Cloning, characterization, and inhibition studies of a new beta-carbonic anhydrase from Mycobacterium tuberculosis. J Med Chem52:3116-20 (2009) 
 
Carbonic anhydrase
Name:Carbonic anhydrase
Type:Enzyme
Mol. Mass.:69636.39
Organism:Mycobacterium tuberculosis
Description:R4ML78
Residue:655
BDBM10877
BDBM10856
NameBDBM10877
Synonyms:4-(2-hydroxyethyl)benzene-1-sulfonamide JMC522226 Compound 21 aromatic/heteroaromatic sulfonamide 22
TypeSmall organic molecule
Emp. Form.C8H11NO3S
Mol. Mass.201.243
SMILESNS(=O)(=O)c1ccc(CCO)cc1