Reaction Details
TargetCarbonic anhydrase
LigandBDBM11639
Substrate/CompetitorBDBM10856
Meas. Tech.CA Inhibition Assay
Ki 7760±n/a nM
Citation Nishimori, IMinakuchi, TVullo, DScozzafava, AInnocenti, ASupuran, CT Carbonic anhydrase inhibitors. Cloning, characterization, and inhibition studies of a new beta-carbonic anhydrase from Mycobacterium tuberculosis. J Med Chem52:3116-20 (2009) 
 
Carbonic anhydrase
Name:Carbonic anhydrase
Type:Enzyme
Mol. Mass.:69636.39
Organism:Mycobacterium tuberculosis
Description:R4ML78
Residue:655
BDBM11639
BDBM10856
NameBDBM11639
Synonyms:4-[5-(4-methylphenyl)-3-(trifluoromethyl)-1H-pyrazol-1-yl]benzene-1-sulfonamide CLX Celecoxib US11478464, Compound Celecoxib US8741944, Comparative Compound cid_2662
TypeSmall organic molecule
Emp. Form.C17H14F3N3O2S
Mol. Mass.381.372
SMILESCc1ccc(cc1)-c1cc(nn1-c1ccc(cc1)S(N)(=O)=O)C(F)(F)F