Reaction Details
TargetSterol 14-alpha demethylase
LigandBDBM29347
Substrate/CompetitorBDBM10852
Meas. Tech.Spectral Titration of TCCYP51
pH7.4±n/a
Temperature297.15±n/a K
Kd 560±80 nM
Citation Konkle, MEHargrove, TYKleshchenko, YYvon Kries, JPRidenour, WUddin, MJCaprioli, RMMarnett, LJNes, WDVillalta, FWaterman, MRLepesheva, GI Indomethacin amides as a novel molecular scaffold for targeting Trypanosoma cruzi sterol 14alpha-demethylase. J Med Chem52:2846-53 (2009) 
 
Sterol 14-alpha demethylase
Name:Sterol 14-alpha demethylase
Type:Protein
Mol. Mass.:54690.12
Organism:Trypanosoma cruzi
Description:Q7Z1V1
Residue:481
BDBM29347
BDBM10852
NameBDBM29347
Synonyms:Indomethacin-amide derivative, 19
TypeSmall organic molecule
Emp. Form.C26H21ClF3N3O3
Mol. Mass.515.911
SMILESCOc1ccc2n(C(=O)c3ccc(Cl)cc3)c(C)c(CC(=O)NCc3ccc(nc3)C(F)(F)F)c2c1