Reaction Details
TargetSterol 14-alpha demethylase
LigandBDBM29348
Substrate/CompetitorBDBM10852
Meas. Tech.Spectral Titration of TCCYP51
pH7.4±n/a
Temperature297.15±n/a K
Kd 260±40 nM
Citation Konkle, MEHargrove, TYKleshchenko, YYvon Kries, JPRidenour, WUddin, MJCaprioli, RMMarnett, LJNes, WDVillalta, FWaterman, MRLepesheva, GI Indomethacin amides as a novel molecular scaffold for targeting Trypanosoma cruzi sterol 14alpha-demethylase. J Med Chem52:2846-53 (2009) 
 
Sterol 14-alpha demethylase
Name:Sterol 14-alpha demethylase
Type:Protein
Mol. Mass.:54690.12
Organism:Trypanosoma cruzi
Description:Q7Z1V1
Residue:481
BDBM29348
BDBM10852
NameBDBM29348
Synonyms:Indomethacin-amide derivative, 18
TypeSmall organic molecule
Emp. Form.C25H21Cl2N3O3
Mol. Mass.482.359
SMILESCOc1ccc2n(C(=O)c3ccc(Cl)cc3)c(C)c(CC(=O)NCc3ccc(Cl)nc3)c2c1