Reaction Details
TargetSterol 14-alpha demethylase
LigandBDBM29350
Substrate/CompetitorBDBM10852
Meas. Tech.Spectral Titration of TCCYP51
pH7.4±n/a
Temperature297.15±n/a K
Kd 360±20 nM
Citation Konkle, MEHargrove, TYKleshchenko, YYvon Kries, JPRidenour, WUddin, MJCaprioli, RMMarnett, LJNes, WDVillalta, FWaterman, MRLepesheva, GI Indomethacin amides as a novel molecular scaffold for targeting Trypanosoma cruzi sterol 14alpha-demethylase. J Med Chem52:2846-53 (2009) 
 
Sterol 14-alpha demethylase
Name:Sterol 14-alpha demethylase
Type:Protein
Mol. Mass.:54690.12
Organism:Trypanosoma cruzi
Description:Q7Z1V1
Residue:481
BDBM29350
BDBM10852
NameBDBM29350
Synonyms:Indomethacin-amide derivative, 21
TypeSmall organic molecule
Emp. Form.C27H24Cl2N2O3
Mol. Mass.495.397
SMILESCOc1ccc2n(C(=O)c3ccc(Cl)cc3)c(C)c(CC(=O)NCCc3cccc(Cl)c3)c2c1