Reaction Details
TargetProthrombin
LigandBDBM29356
Substrate/CompetitorBDBM13573
Meas. Tech.Surface Plasmon Resonance (SPR)-Based Biosensor Measurements (KD) and Enzyme Inhibition Assay (IC50)
pH7.4±n/a
Temperature310.15±n/a K
IC50>400000±n/a nM
Kd>1000000±n/a nM
Citation Nilsson, MHämäläinen, MIvarsson, MGottfries, JXue, YHansson, SIsaksson, RFex, T Compounds binding to the S2-S3 pockets of thrombin. J Med Chem52:2708-15 (2009) 
 
Prothrombin
Name:Prothrombin
Type:Protein
Mol. Mass.:70029.57
Organism:Homo sapiens (Human)
Description:P00734
Residue:622
BDBM29356
BDBM13573
NameBDBM29356
Synonyms:proline scaffold, 5
TypeSmall organic molecule
Emp. Form.C21H24N2O2
Mol. Mass.336.4275
SMILESCNC(=O)[C@@H]1CCCN1C(=O)CC(c1ccccc1)c1ccccc1