Reaction Details
TargetProthrombin
LigandBDBM29380
Substrate/CompetitorBDBM13573
Meas. Tech.Surface Plasmon Resonance (SPR)-Based Biosensor Measurements (KD) and Enzyme Inhibition Assay (IC50)
IC50>400000±n/a nM
Kd 790000±n/a nM
Citation Nilsson, MHämäläinen, MIvarsson, MGottfries, JXue, YHansson, SIsaksson, RFex, T Compounds binding to the S2-S3 pockets of thrombin. J Med Chem52:2708-15 (2009) 
 
Prothrombin
Name:Prothrombin
Type:Protein
Mol. Mass.:70029.57
Organism:Homo sapiens (Human)
Description:P00734
Residue:622
BDBM29380
BDBM13573
NameBDBM29380
Synonyms:proline scaffold, 29
TypeSmall organic molecule
Emp. Form.C14H25N3O2
Mol. Mass.267.3672
SMILESCNC(=O)[C@@H]1CCCN1C(=O)[C@H](N)C1CCCCC1