Reaction Details
TargetProthrombin
LigandBDBM29388
Substrate/CompetitorBDBM13573
IC50 8±n/a nM
Citation Nilsson, MHämäläinen, MIvarsson, MGottfries, JXue, YHansson, SIsaksson, RFex, T Compounds binding to the S2-S3 pockets of thrombin. J Med Chem52:2708-15 (2009) 
 
Prothrombin
Name:Prothrombin
Type:Protein
Mol. Mass.:70029.57
Organism:Homo sapiens (Human)
Description:P00734
Residue:622
BDBM29388
BDBM13573
NameBDBM29388
Synonyms:Exanta US11584714, Compound 999
TypeSmall organic molecule
Emp. Form.C22H31N5O4
Mol. Mass.429.5126
SMILESNC(=N)c1ccc(CNC(=O)[C@@H]2CCN2C(=O)[C@H](NCC(O)=O)C2CCCCC2)cc1