Reaction Details
TargetRibosyldihydronicotinamide dehydrogenase [quinone]
LigandBDBM9019
Substrate/CompetitorBDBM29211
Meas. Tech.QR2 Inhibition Assay
pH8±n/a
Temperature298.15±n/a K
IC50 11300±2100 nM
Citation Calamini, BSantarsiero, BDBoutin, JAMesecar, AD Kinetic, thermodynamic and X-ray structural insights into the interaction of melatonin and analogues with quinone reductase 2. Biochem J413:81-91 (2008) 
 
Ribosyldihydronicotinamide dehydrogenase [quinone]
Name:Ribosyldihydronicotinamide dehydrogenase [quinone]
Type:Protein
Mol. Mass.:25917.25
Organism:Homo sapiens (Human)
Description:P16083
Residue:231
BDBM9019
BDBM29211
NameBDBM9019
Synonyms:CHEMBL45 N-[2-(5-methoxy-1H-indol-3-yl)ethyl]acetamide
TypeSmall organic molecule
Emp. Form.C13H16N2O2
Mol. Mass.232.2783
SMILESCOc1ccc2[nH]cc(CCNC(C)=O)c2c1