Reaction Details
TargetRibosyldihydronicotinamide dehydrogenase [quinone]
LigandBDBM23926
Substrate/CompetitorBDBM29211
Meas. Tech.QR2 Inhibition Assay
pH8±n/a
Temperature298.15±n/a K
IC50 960±130 nM
Citation Calamini, BSantarsiero, BDBoutin, JAMesecar, AD Kinetic, thermodynamic and X-ray structural insights into the interaction of melatonin and analogues with quinone reductase 2. Biochem J413:81-91 (2008) 
 
Ribosyldihydronicotinamide dehydrogenase [quinone]
Name:Ribosyldihydronicotinamide dehydrogenase [quinone]
Type:Protein
Mol. Mass.:25917.25
Organism:Homo sapiens (Human)
Description:P16083
Residue:231
BDBM23926
BDBM29211
NameBDBM23926
Synonyms:(E)-resveratrol CHEMBL165 Stilbene, 2f cid_445154 trans-resveratrol
TypeSmall organic molecule
Emp. Form.C14H12O3
Mol. Mass.228.2433
SMILESOc1ccc(\C=C\c2cc(O)cc(O)c2)cc1